lists  /  announce  owl-users  owl-dev  john-users  john-dev  passwdqc-users  yescrypt  popa3d-users  /  oss-security  kernel-hardening  musl  sabotage  tlsify  passwords  /  crypt-dev  xvendor  /  Bugtraq  Full-Disclosure  linux-kernel  linux-netdev  linux-ext4  PHC 
Open Source and information security mailing list archives
Hash Suite: Windows password security audit tool. GUI, reports in PDF.
[<prev] [next>] [<thread-prev] [thread-next>] [day] [month] [year] [list]
Date:	Fri, 14 Feb 2014 14:32:51 -0800
From:	"H. Peter Anvin" <>
To:	Stefani Seibold <>,,,,,,,,,,,,
Subject: Re: [PATCH v16 0/10] Add 32 bit VDSO time function support

I still get build errors.

i386 allyesconfig, i386 allmodconfig as well as a more basic i386

arch/x86/vdso/ undefined symbols found
make[4]: *** [arch/x86/vdso/] Error 1

x86-64 allyesconfig and x86-64 allmodconfig:

/home/hpa/kernel/distwork/arch/x86/vdso/vdso32/../vclock_gettime.c:128:4: warning:
symbol 'hpet_page' was not declared
. Should it be static?
warning: incorrect type in argument 1 (diff
erent address spaces)
   expected void const volatile [noderef] <
   got unsigned char [toplevel] *
warning: symbol '__vdso_clock_gettime' was
not declared. Should it be static?
warning: symbol '__vdso_gettimeofday' was n
ot declared. Should it be static?
warning: symbol '__vdso_time' was not decla
red. Should it be static?
  CC      arch/x86/vdso/vdso32/vclock_gettime.o
sorry, unimplemented: -mfentry isn’t supported fo
r 32-bit in combination with -fpic
 #define BUILD_VDSO32
make[4]: *** [arch/x86/vdso/vdso32/vclock_gettime.o] Error 1
make[3]: *** [arch/x86/vdso] Error 2
make[3]: *** Waiting for unfinished jobs....

This is after I removed the incorrect "generated/" filename prefix in
patch 9.


To unsubscribe from this list: send the line "unsubscribe linux-kernel" in
the body of a message to
More majordomo info at
Please read the FAQ at

Powered by blists - more mailing lists