lists.openwall.net   lists  /  announce  owl-users  owl-dev  john-users  john-dev  passwdqc-users  yescrypt  popa3d-users  /  oss-security  kernel-hardening  musl  sabotage  tlsify  passwords  /  crypt-dev  xvendor  /  Bugtraq  Full-Disclosure  linux-kernel  linux-netdev  linux-ext4  linux-hardening  PHC 
Open Source and information security mailing list archives
 
Hash Suite: Windows password security audit tool. GUI, reports in PDF.
[<prev] [next>] [<thread-prev] [thread-next>] [day] [month] [year] [list]
Date:   Thu, 22 Jul 2021 20:48:47 +0200
From:   Greg Kroah-Hartman <gregkh@...uxfoundation.org>
To:     Daniel Díaz <daniel.diaz@...aro.org>
Cc:     torvalds@...ux-foundation.org, akpm@...ux-foundation.org,
        linux@...ck-us.net, shuah@...nel.org, patches@...nelci.org,
        lkft-triage@...ts.linaro.org, pavel@...x.de, jonathanh@...dia.com,
        f.fainelli@...il.com, stable@...r.kernel.org,
        linux-kernel@...r.kernel.org, aford173@...il.com
Subject: Re: [PATCH 5.10 000/125] 5.10.53-rc1 review

On Thu, Jul 22, 2021 at 12:00:34PM -0500, Daniel Díaz wrote:
> Hello!
> 
> On 7/22/21 11:29 AM, Greg Kroah-Hartman wrote:
> > This is the start of the stable review cycle for the 5.10.53 release.
> > There are 125 patches in this series, all will be posted as a response
> > to this one.  If anyone has any issues with these being applied, please
> > let me know.
> > 
> > Responses should be made by Sat, 24 Jul 2021 15:56:00 +0000.
> > Anything received after that time might be too late.
> > 
> > The whole patch series can be found in one patch at:
> > 	https://www.kernel.org/pub/linux/kernel/v5.x/stable-review/patch-5.10.53-rc1.gz
> > or in the git tree and branch at:
> > 	git://git.kernel.org/pub/scm/linux/kernel/git/stable/linux-stable-rc.git linux-5.10.y
> > and the diffstat can be found below.
> > 
> > thanks,
> > 
> > greg k-h
> 
> Build regressions detected on Arm64:
> 
>   make --silent --keep-going --jobs=8 O=/home/tuxbuild/.cache/tuxmake/builds/current ARCH=arm64 CROSS_COMPILE=aarch64-linux-gnu- 'CC=sccache aarch64-linux-gnu-gcc' 'HOSTCC=sccache gcc' dtbs
>   Error: /builds/linux/arch/arm64/boot/dts/renesas/beacon-renesom-som.dtsi:298.1-13 Label or path usb2_clksel not found
>   FATAL ERROR: Syntax error parsing input tree
>   make[3]: *** [scripts/Makefile.lib:326: arch/arm64/boot/dts/renesas/r8a774a1-beacon-rzg2m-kit.dtb] Error 1
>   make[3]: Target '__build' not remade because of errors.
>   make[2]: *** [/builds/linux/scripts/Makefile.build:497: arch/arm64/boot/dts/renesas] Error 2
>   make[2]: Target '__build' not remade because of errors.
>   make[1]: *** [/builds/linux/Makefile:1359: dtbs] Error 2
>   make: *** [Makefile:185: __sub-make] Error 2
>   make: Target 'dtbs' not remade because of errors.

2 patches dropped should now fix this.  I will push out a -rc2 now.

thanks,

greg k-h

Powered by blists - more mailing lists