lists.openwall.net   lists  /  announce  owl-users  owl-dev  john-users  john-dev  passwdqc-users  yescrypt  popa3d-users  /  oss-security  kernel-hardening  musl  sabotage  tlsify  passwords  /  crypt-dev  xvendor  /  Bugtraq  Full-Disclosure  linux-kernel  linux-netdev  linux-ext4  linux-hardening  PHC 
Open Source and information security mailing list archives
 
Hash Suite: Windows password security audit tool. GUI, reports in PDF.
[<prev] [next>] [<thread-prev] [thread-next>] [day] [month] [year] [list]
Date:   Fri, 23 Jul 2021 08:31:05 -0600
From:   Rob Herring <robh@...nel.org>
To:     quic_vamslank@...cinc.com
Cc:     linux-clk@...r.kernel.org, maz@...nel.org, sboyd@...nel.org,
        devicetree@...r.kernel.org, linux-arm-msm@...r.kernel.org,
        tglx@...utronix.de, mturquette@...libre.com, agross@...nel.org,
        bjorn.andersson@...aro.org, linux-kernel@...r.kernel.org,
        robh+dt@...nel.org
Subject: Re: [PATCH v2 1/6] dt-bindings: clock: Add SDX65 GCC clock bindings

On Thu, 22 Jul 2021 14:09:38 -0700, quic_vamslank@...cinc.com wrote:
> From: Vamsi krishna Lanka <quic_vamslank@...cinc.com>
> 
> Add device tree bindings for global clock controller on SDX65 SOCs.
> 
> Signed-off-by: Vamsi Krishna Lanka <quic_vamslank@...cinc.com>
> ---
>  .../bindings/clock/qcom,gcc-sdx65.yaml        |  79 ++++++++++++
>  include/dt-bindings/clock/qcom,gcc-sdx65.h    | 122 ++++++++++++++++++
>  2 files changed, 201 insertions(+)
>  create mode 100644 Documentation/devicetree/bindings/clock/qcom,gcc-sdx65.yaml
>  create mode 100644 include/dt-bindings/clock/qcom,gcc-sdx65.h
> 

My bot found errors running 'make DT_CHECKER_FLAGS=-m dt_binding_check'
on your patch (DT_CHECKER_FLAGS is new in v5.13):

yamllint warnings/errors:

dtschema/dtc warnings/errors:
make[1]: *** Deleting file 'Documentation/devicetree/bindings/clock/qcom,gcc-sdx65.example.dts'
Traceback (most recent call last):
  File "/usr/local/bin/dt-extract-example", line 45, in <module>
    binding = yaml.load(open(args.yamlfile, encoding='utf-8').read())
  File "/usr/local/lib/python3.8/dist-packages/ruamel/yaml/main.py", line 434, in load
    return constructor.get_single_data()
  File "/usr/local/lib/python3.8/dist-packages/ruamel/yaml/constructor.py", line 120, in get_single_data
    node = self.composer.get_single_node()
  File "_ruamel_yaml.pyx", line 706, in _ruamel_yaml.CParser.get_single_node
  File "_ruamel_yaml.pyx", line 724, in _ruamel_yaml.CParser._compose_document
  File "_ruamel_yaml.pyx", line 775, in _ruamel_yaml.CParser._compose_node
  File "_ruamel_yaml.pyx", line 889, in _ruamel_yaml.CParser._compose_mapping_node
  File "_ruamel_yaml.pyx", line 773, in _ruamel_yaml.CParser._compose_node
  File "_ruamel_yaml.pyx", line 848, in _ruamel_yaml.CParser._compose_sequence_node
  File "_ruamel_yaml.pyx", line 904, in _ruamel_yaml.CParser._parse_next_event
ruamel.yaml.scanner.ScannerError: while scanning a block scalar
  in "<unicode string>", line 65, column 5
found a tab character where an indentation space is expected
  in "<unicode string>", line 71, column 1
make[1]: *** [Documentation/devicetree/bindings/Makefile:20: Documentation/devicetree/bindings/clock/qcom,gcc-sdx65.example.dts] Error 1
make[1]: *** Waiting for unfinished jobs....
./Documentation/devicetree/bindings/clock/qcom,gcc-sdx65.yaml:  while scanning a block scalar
  in "<unicode string>", line 65, column 5
found a tab character where an indentation space is expected
  in "<unicode string>", line 71, column 1
/builds/robherring/linux-dt-review/Documentation/devicetree/bindings/clock/qcom,gcc-sdx65.yaml: ignoring, error parsing file
warning: no schema found in file: ./Documentation/devicetree/bindings/clock/qcom,gcc-sdx65.yaml
make: *** [Makefile:1418: dt_binding_check] Error 2
\ndoc reference errors (make refcheckdocs):

See https://patchwork.ozlabs.org/patch/1508862

This check can fail if there are any dependencies. The base for a patch
series is generally the most recent rc1.

If you already ran 'make dt_binding_check' and didn't see the above
error(s), then make sure 'yamllint' is installed and dt-schema is up to
date:

pip3 install dtschema --upgrade

Please check and re-submit.

Powered by blists - more mailing lists