lists.openwall.net   lists  /  announce  owl-users  owl-dev  john-users  john-dev  passwdqc-users  yescrypt  popa3d-users  /  oss-security  kernel-hardening  musl  sabotage  tlsify  passwords  /  crypt-dev  xvendor  /  Bugtraq  Full-Disclosure  linux-kernel  linux-netdev  linux-ext4  linux-hardening  PHC 
Open Source and information security mailing list archives
 
Hash Suite: Windows password security audit tool. GUI, reports in PDF.
[<prev] [next>] [<thread-prev] [thread-next>] [day] [month] [year] [list]
Date:   Tue, 05 Oct 2021 17:45:59 -0500
From:   Rob Herring <robh@...nel.org>
To:     Jerome Pouiller <Jerome.Pouiller@...abs.com>
Cc:     devicetree@...r.kernel.org,
        Greg Kroah-Hartman <gregkh@...uxfoundation.org>,
        Jérôme Pouiller <jerome.pouiller@...abs.com>,
        netdev@...r.kernel.org, Rob Herring <robh+dt@...nel.org>,
        devel@...verdev.osuosl.org,
        Pali Rohár <pali@...nel.org>,
        Kalle Valo <kvalo@...eaurora.org>,
        linux-kernel@...r.kernel.org, Ulf Hansson <ulf.hansson@...aro.org>,
        "David S . Miller" <davem@...emloft.net>,
        linux-wireless@...r.kernel.org, linux-mmc@...r.kernel.org
Subject: Re: [PATCH v8 02/24] dt-bindings: introduce silabs,wfx.yaml

On Tue, 05 Oct 2021 15:53:38 +0200, Jerome Pouiller wrote:
> From: Jérôme Pouiller <jerome.pouiller@...abs.com>
> 
> Prepare the inclusion of the wfx driver in the kernel.
> 
> Signed-off-by: Jérôme Pouiller <jerome.pouiller@...abs.com>
> ---
>  .../bindings/net/wireless/silabs,wfx.yaml     | 137 ++++++++++++++++++
>  1 file changed, 137 insertions(+)
>  create mode 100644 Documentation/devicetree/bindings/net/wireless/silabs,wfx.yaml
> 

My bot found errors running 'make DT_CHECKER_FLAGS=-m dt_binding_check'
on your patch (DT_CHECKER_FLAGS is new in v5.13):

yamllint warnings/errors:
./Documentation/devicetree/bindings/net/wireless/silabs,wfx.yaml:39:31: [error] syntax error: mapping values are not allowed here (syntax)

dtschema/dtc warnings/errors:
make[1]: *** Deleting file 'Documentation/devicetree/bindings/net/wireless/silabs,wfx.example.dts'
Traceback (most recent call last):
  File "/usr/local/bin/dt-extract-example", line 45, in <module>
    binding = yaml.load(open(args.yamlfile, encoding='utf-8').read())
  File "/usr/local/lib/python3.8/dist-packages/ruamel/yaml/main.py", line 434, in load
    return constructor.get_single_data()
  File "/usr/local/lib/python3.8/dist-packages/ruamel/yaml/constructor.py", line 120, in get_single_data
    node = self.composer.get_single_node()
  File "_ruamel_yaml.pyx", line 706, in _ruamel_yaml.CParser.get_single_node
  File "_ruamel_yaml.pyx", line 724, in _ruamel_yaml.CParser._compose_document
  File "_ruamel_yaml.pyx", line 775, in _ruamel_yaml.CParser._compose_node
  File "_ruamel_yaml.pyx", line 889, in _ruamel_yaml.CParser._compose_mapping_node
  File "_ruamel_yaml.pyx", line 775, in _ruamel_yaml.CParser._compose_node
  File "_ruamel_yaml.pyx", line 891, in _ruamel_yaml.CParser._compose_mapping_node
  File "_ruamel_yaml.pyx", line 904, in _ruamel_yaml.CParser._parse_next_event
ruamel.yaml.scanner.ScannerError: mapping values are not allowed in this context
  in "<unicode string>", line 39, column 31
make[1]: *** [Documentation/devicetree/bindings/Makefile:20: Documentation/devicetree/bindings/net/wireless/silabs,wfx.example.dts] Error 1
make[1]: *** Waiting for unfinished jobs....
./Documentation/devicetree/bindings/net/wireless/silabs,wfx.yaml:  mapping values are not allowed in this context
  in "<unicode string>", line 39, column 31
/builds/robherring/linux-dt-review/Documentation/devicetree/bindings/net/wireless/silabs,wfx.yaml: ignoring, error parsing file
warning: no schema found in file: ./Documentation/devicetree/bindings/net/wireless/silabs,wfx.yaml
make: *** [Makefile:1441: dt_binding_check] Error 2

doc reference errors (make refcheckdocs):

See https://patchwork.ozlabs.org/patch/1536655

This check can fail if there are any dependencies. The base for a patch
series is generally the most recent rc1.

If you already ran 'make dt_binding_check' and didn't see the above
error(s), then make sure 'yamllint' is installed and dt-schema is up to
date:

pip3 install dtschema --upgrade

Please check and re-submit.

Powered by blists - more mailing lists