lists.openwall.net   lists  /  announce  owl-users  owl-dev  john-users  john-dev  passwdqc-users  yescrypt  popa3d-users  /  oss-security  kernel-hardening  musl  sabotage  tlsify  passwords  /  crypt-dev  xvendor  /  Bugtraq  Full-Disclosure  linux-kernel  linux-netdev  linux-ext4  linux-hardening  PHC 
Open Source and information security mailing list archives
 
Hash Suite for Android: free password hash cracker in your pocket
[<prev] [next>] [<thread-prev] [thread-next>] [day] [month] [year] [list]
Date:   Tue, 05 Oct 2021 07:26:38 -0500
From:   Rob Herring <robh@...nel.org>
To:     Kunihiko Hayashi <hayashi.kunihiko@...ionext.com>
Cc:     linux-arm-kernel@...ts.infradead.org,
        Stephen Boyd <sboyd@...nel.org>, linux-clk@...r.kernel.org,
        Masami Hiramatsu <mhiramat@...nel.org>,
        linux-kernel@...r.kernel.org, devicetree@...r.kernel.org,
        Michael Turquette <mturquette@...libre.com>,
        Rob Herring <robh+dt@...nel.org>
Subject: Re: [PATCH 4/5] dt-bindings: clock: uniphier: Add clock binding for SoC-glue

On Tue, 05 Oct 2021 11:08:25 +0900, Kunihiko Hayashi wrote:
> Update binding document for clocks implemented in SoC-glue.
> 
> Signed-off-by: Kunihiko Hayashi <hayashi.kunihiko@...ionext.com>
> ---
>  .../bindings/clock/socionext,uniphier-clock.yaml         | 16 ++++++++++++++++
>  1 file changed, 16 insertions(+)
> 

My bot found errors running 'make DT_CHECKER_FLAGS=-m dt_binding_check'
on your patch (DT_CHECKER_FLAGS is new in v5.13):

yamllint warnings/errors:
./Documentation/devicetree/bindings/clock/socionext,uniphier-clock.yaml:51:1: [error] syntax error: found character '\t' that cannot start any token (syntax)

dtschema/dtc warnings/errors:
make[1]: *** Deleting file 'Documentation/devicetree/bindings/clock/socionext,uniphier-clock.example.dts'
Traceback (most recent call last):
  File "/usr/local/bin/dt-extract-example", line 45, in <module>
    binding = yaml.load(open(args.yamlfile, encoding='utf-8').read())
  File "/usr/local/lib/python3.8/dist-packages/ruamel/yaml/main.py", line 434, in load
    return constructor.get_single_data()
  File "/usr/local/lib/python3.8/dist-packages/ruamel/yaml/constructor.py", line 120, in get_single_data
    node = self.composer.get_single_node()
  File "_ruamel_yaml.pyx", line 706, in _ruamel_yaml.CParser.get_single_node
  File "_ruamel_yaml.pyx", line 724, in _ruamel_yaml.CParser._compose_document
  File "_ruamel_yaml.pyx", line 775, in _ruamel_yaml.CParser._compose_node
  File "_ruamel_yaml.pyx", line 889, in _ruamel_yaml.CParser._compose_mapping_node
  File "_ruamel_yaml.pyx", line 775, in _ruamel_yaml.CParser._compose_node
  File "_ruamel_yaml.pyx", line 889, in _ruamel_yaml.CParser._compose_mapping_node
  File "_ruamel_yaml.pyx", line 775, in _ruamel_yaml.CParser._compose_node
  File "_ruamel_yaml.pyx", line 889, in _ruamel_yaml.CParser._compose_mapping_node
  File "_ruamel_yaml.pyx", line 773, in _ruamel_yaml.CParser._compose_node
  File "_ruamel_yaml.pyx", line 850, in _ruamel_yaml.CParser._compose_sequence_node
  File "_ruamel_yaml.pyx", line 775, in _ruamel_yaml.CParser._compose_node
  File "_ruamel_yaml.pyx", line 889, in _ruamel_yaml.CParser._compose_mapping_node
  File "_ruamel_yaml.pyx", line 731, in _ruamel_yaml.CParser._compose_node
  File "_ruamel_yaml.pyx", line 904, in _ruamel_yaml.CParser._parse_next_event
ruamel.yaml.scanner.ScannerError: while scanning for the next token
found character that cannot start any token
  in "<unicode string>", line 51, column 1
make[1]: *** [Documentation/devicetree/bindings/Makefile:20: Documentation/devicetree/bindings/clock/socionext,uniphier-clock.example.dts] Error 1
make[1]: *** Waiting for unfinished jobs....
./Documentation/devicetree/bindings/clock/socionext,uniphier-clock.yaml:  while scanning for the next token
found character that cannot start any token
  in "<unicode string>", line 51, column 1
/builds/robherring/linux-dt-review/Documentation/devicetree/bindings/clock/socionext,uniphier-clock.yaml: ignoring, error parsing file
warning: no schema found in file: ./Documentation/devicetree/bindings/clock/socionext,uniphier-clock.yaml
make: *** [Makefile:1441: dt_binding_check] Error 2

doc reference errors (make refcheckdocs):

See https://patchwork.ozlabs.org/patch/1536449

This check can fail if there are any dependencies. The base for a patch
series is generally the most recent rc1.

If you already ran 'make dt_binding_check' and didn't see the above
error(s), then make sure 'yamllint' is installed and dt-schema is up to
date:

pip3 install dtschema --upgrade

Please check and re-submit.

Powered by blists - more mailing lists