lists  /  announce  owl-users  owl-dev  john-users  john-dev  passwdqc-users  yescrypt  popa3d-users  /  oss-security  kernel-hardening  musl  sabotage  tlsify  passwords  /  crypt-dev  xvendor  /  Bugtraq  Full-Disclosure  linux-kernel  linux-netdev  linux-ext4  linux-hardening  linux-cve-announce  PHC 
Open Source and information security mailing list archives
Hash Suite: Windows password security audit tool. GUI, reports in PDF.
[<prev] [next>] [day] [month] [year] [list]
Date:   Mon, 21 Feb 2022 05:12:04 +0800
From:   kernel test robot <>
To:     Ingo Molnar <>
Subject: [mingo-tip:sched/headers 643/2574]
 include/asm-generic/barrier.h:16:10: fatal error: 'asm/vdso/processor.h'
 file not found

tree:   git:// sched/headers
head:   39e8a0edc8fae20758051dadf7846849edc18b88
commit: 121f4f0dd58c5fa0666a732d13b7ad770af3559b [643/2574] headers/deps: Add header dependencies to .h files: <asm/vdso/processor.h>
config: hexagon-randconfig-r045-20220220 (
compiler: clang version 15.0.0 ( d271fc04d5b97b12e6b797c6067d3c96a8d7470e)
reproduce (this is a W=1 build):
        wget -O ~/bin/make.cross
        chmod +x ~/bin/make.cross
        git remote add mingo-tip git://
        git fetch --no-tags mingo-tip sched/headers
        git checkout 121f4f0dd58c5fa0666a732d13b7ad770af3559b
        # save the config file to linux build tree
        mkdir build_dir
        COMPILER_INSTALL_PATH=$HOME/0day COMPILER=clang make.cross W=1 O=build_dir ARCH=hexagon prepare

If you fix the issue, kindly add following tag as appropriate
Reported-by: kernel test robot <>

All errors (new ones prefixed by >>):

   In file included from kernel/bounds.c:13:
   In file included from include/linux/log2.h:12:
   In file included from include/linux/bitops.h:28:
   In file included from arch/hexagon/include/asm/bitops.h:13:
   In file included from arch/hexagon/include/asm/atomic.h:13:
   In file included from ./arch/hexagon/include/generated/asm/barrier.h:1:
>> include/asm-generic/barrier.h:16:10: fatal error: 'asm/vdso/processor.h' file not found
   #include <asm/vdso/processor.h>
   1 error generated.
   make[2]: *** [scripts/ kernel/bounds.s] Error 1
   make[2]: Target '__build' not remade because of errors.
   make[1]: *** [Makefile:1191: prepare0] Error 2
   make[1]: Target 'prepare' not remade because of errors.
   make: *** [Makefile:219: __sub-make] Error 2
   make: Target 'prepare' not remade because of errors.

vim +16 include/asm-generic/barrier.h

  > 16	#include <asm/vdso/processor.h>
    17	#include <linux/compiler.h>
    18	#include <linux/kcsan-checks.h>
    19	#include <asm/rwonce.h>

0-DAY CI Kernel Test Service, Intel Corporation

Powered by blists - more mailing lists