lists.openwall.net   lists  /  announce  owl-users  owl-dev  john-users  john-dev  passwdqc-users  yescrypt  popa3d-users  /  oss-security  kernel-hardening  musl  sabotage  tlsify  passwords  /  crypt-dev  xvendor  /  Bugtraq  Full-Disclosure  linux-kernel  linux-netdev  linux-ext4  linux-hardening  PHC 
Open Source and information security mailing list archives
 
Hash Suite: Windows password security audit tool. GUI, reports in PDF.
[<prev] [next>] [thread-next>] [day] [month] [year] [list]
Date:   Wed, 21 Jul 2021 11:26:52 +1000
From:   Stephen Rothwell <sfr@...b.auug.org.au>
To:     David Miller <davem@...emloft.net>,
        Networking <netdev@...r.kernel.org>
Cc:     Vladimir Oltean <vladimir.oltean@....com>,
        Linux Kernel Mailing List <linux-kernel@...r.kernel.org>,
        Linux Next Mailing List <linux-next@...r.kernel.org>
Subject: linux-next: build failure after merge of the net-next tree

Hi all,

After merging the net-next tree, today's linux-next build (powerpc
ppc64_defconfig) failed like this:

In file included from include/net/dsa.h:23,
                 from net/ethernet/eth.c:59:
include/net/switchdev.h:410:1: error: expected identifier or '(' before '{' token
  410 | {
      | ^
include/net/switchdev.h:399:1: warning: 'switchdev_handle_fdb_del_to_device' declared 'static' but never defined [-Wunused-function]
  399 | switchdev_handle_fdb_del_to_device(struct net_device *dev,
      | ^~~~~~~~~~~~~~~~~~~~~~~~~~~~~~~~~~
In file included from include/net/dsa.h:23,
                 from net/core/flow_dissector.c:8:
include/net/switchdev.h:410:1: error: expected identifier or '(' before '{' token
  410 | {
      | ^
include/net/switchdev.h:399:1: warning: 'switchdev_handle_fdb_del_to_device' declared 'static' but never defined [-Wunused-function]
  399 | switchdev_handle_fdb_del_to_device(struct net_device *dev,
      | ^~~~~~~~~~~~~~~~~~~~~~~~~~~~~~~~~~
In file included from include/net/dsa.h:23,
                 from net/core/dev.c:102:
include/net/switchdev.h:410:1: error: expected identifier or '(' before '{' token
  410 | {
      | ^
include/net/switchdev.h:399:1: warning: 'switchdev_handle_fdb_del_to_device' declared 'static' but never defined [-Wunused-function]
  399 | switchdev_handle_fdb_del_to_device(struct net_device *dev,
      | ^~~~~~~~~~~~~~~~~~~~~~~~~~~~~~~~~~
In file included from include/net/vxlan.h:9,
                 from drivers/net/ethernet/emulex/benet/be_main.c:22:
include/net/switchdev.h:410:1: error: expected identifier or '(' before '{' token
  410 | {
      | ^
include/net/switchdev.h:399:1: warning: 'switchdev_handle_fdb_del_to_device' declared 'static' but never defined [-Wunused-function]
  399 | switchdev_handle_fdb_del_to_device(struct net_device *dev,
      | ^~~~~~~~~~~~~~~~~~~~~~~~~~~~~~~~~~
In file included from include/net/vxlan.h:9,
                 from drivers/net/ethernet/intel/ixgbe/ixgbe_main.c:37:
include/net/switchdev.h:410:1: error: expected identifier or '(' before '{' token
  410 | {
      | ^
include/net/switchdev.h:399:1: warning: 'switchdev_handle_fdb_del_to_device' declared 'static' but never defined [-Wunused-function]
  399 | switchdev_handle_fdb_del_to_device(struct net_device *dev,
      | ^~~~~~~~~~~~~~~~~~~~~~~~~~~~~~~~~~
In file included from include/net/vxlan.h:9,
                 from drivers/net/ethernet/broadcom/bnx2x/bnx2x_main.c:50:
include/net/switchdev.h:410:1: error: expected identifier or '(' before '{' token
  410 | {
      | ^
include/net/switchdev.h:399:1: warning: 'switchdev_handle_fdb_del_to_device' declared 'static' but never defined [-Wunused-function]
  399 | switchdev_handle_fdb_del_to_device(struct net_device *dev,
      | ^~~~~~~~~~~~~~~~~~~~~~~~~~~~~~~~~~

Caused by commit

  8ca07176ab00 ("net: switchdev: introduce a fanout helper for SWITCHDEV_FDB_{ADD,DEL}_TO_DEVICE")

I have used the net-next tree from next-20210720 for today.

-- 
Cheers,
Stephen Rothwell

Content of type "application/pgp-signature" skipped

Powered by blists - more mailing lists