[<prev] [next>] [<thread-prev] [thread-next>] [day] [month] [year] [list]
Message-ID: <202508280749.JlXoz9Mz-lkp@intel.com>
Date: Thu, 28 Aug 2025 08:15:14 +0800
From: kernel test robot <lkp@...el.com>
To: Daniel Jurgens <danielj@...dia.com>, netdev@...r.kernel.org,
mst@...hat.com, jasowang@...hat.com, alex.williamson@...hat.com,
virtualization@...ts.linux.dev, pabeni@...hat.com
Cc: oe-kbuild-all@...ts.linux.dev, parav@...dia.com, shshitrit@...dia.com,
yohadt@...dia.com, Daniel Jurgens <danielj@...dia.com>
Subject: Re: [PATCH net-next 04/11] virtio_net: Query and set flow filter caps
Hi Daniel,
kernel test robot noticed the following build errors:
[auto build test ERROR on net-next/main]
url: https://github.com/intel-lab-lkp/linux/commits/Daniel-Jurgens/virtio-pci-Expose-generic-device-capability-operations/20250828-024128
base: net-next/main
patch link: https://lore.kernel.org/r/20250827183852.2471-5-danielj%40nvidia.com
patch subject: [PATCH net-next 04/11] virtio_net: Query and set flow filter caps
config: i386-buildonly-randconfig-002-20250828 (https://download.01.org/0day-ci/archive/20250828/202508280749.JlXoz9Mz-lkp@intel.com/config)
compiler: gcc-12 (Debian 12.2.0-14+deb12u1) 12.2.0
reproduce (this is a W=1 build): (https://download.01.org/0day-ci/archive/20250828/202508280749.JlXoz9Mz-lkp@intel.com/reproduce)
If you fix the issue in a separate patch/commit (i.e. not just a new version of
the same patch/commit), kindly add following tags
| Reported-by: kernel test robot <lkp@...el.com>
| Closes: https://lore.kernel.org/oe-kbuild-all/202508280749.JlXoz9Mz-lkp@intel.com/
All errors (new ones prefixed by >>):
>> error: include/uapi/linux/virtio_net_ff.h: missing "WITH Linux-syscall-note" for SPDX-License-Identifier
make[3]: *** [scripts/Makefile.headersinst:63: usr/include/linux/virtio_net_ff.h] Error 1 shuffle=2238678394
make[3]: Target '__headers' not remade because of errors.
make[2]: *** [Makefile:1380: headers] Error 2 shuffle=2238678394
make[2]: Target 'prepare' not remade because of errors.
make[1]: *** [Makefile:248: __sub-make] Error 2 shuffle=2238678394
make[1]: Target 'prepare' not remade because of errors.
make: *** [Makefile:248: __sub-make] Error 2 shuffle=2238678394
make: Target 'prepare' not remade because of errors.
--
0-DAY CI Kernel Test Service
https://github.com/intel/lkp-tests/wiki
Powered by blists - more mailing lists